Next Generation Emulation banner
1 - 2 of 2 Posts

· Registered
Joined
·
1 Posts
Discussion Starter · #1 ·
Ok, first off...I come back after a year or so and find that both me e-mail addressses are banned and there is no data on my old username...WTF?
I've never been banned from any forums before and why the hell would anyone ban me here without telling me why?

Anyways, now that I've let the steam off, I have alot of concerns with running PCSX2.
It seems to be the only one supporting linux and well, I want to see how it works under linux compared to Windows. So, I'm trying to compile it and well, I get alot of errors! (I'm compiling it as the pre-build is not working right...not detecting all plugins and well, I want an optimized install)

So...here's the prob:
Code:
gcc -Wall -O2 -fomit-frame-pointer -finline-functions -ffast-math -fno-strict-al
iasing -m128bit-long-double -I. -I.. -I../IPU -I../DebugTools -D__LINUX__ -DENAB
LE_NLS -DPACKAGE=\"pcsx2\" -I../ix86-32 -I../x86  -c -o ../Elfheader.o ../Elfhea
der.c -MD -MF ../Elfheader.d
../Elfheader.c: In function 'parseCommandLine':
../Elfheader.c:187: warning: pointer targets in passing argument 1 of 'strcpy' d
iffer in signedness
../Elfheader.c: In function 'loadElfFile':
../Elfheader.c:575: warning: pointer targets in passing argument 2 of 'readFile'
 differ in signedness
../Elfheader.c:602: warning: null argument where non-null required (argument 1)
../Elfheader.c:602: warning: null argument where non-null required (argument 1)
../Elfheader.c:602: warning: null argument where non-null required (argument 2)
../Elfheader.c:602: warning: null argument where non-null required (argument 2)
../Elfheader.c:602: warning: null argument where non-null required (argument 1)
../Elfheader.c:602: warning: null argument where non-null required (argument 1)
../Elfheader.c:602: warning: null argument where non-null required (argument 2)
../Elfheader.c:602: warning: null argument where non-null required (argument 2)
../Elfheader.c:603: warning: null argument where non-null required (argument 1)
../Elfheader.c:603: warning: null argument where non-null required (argument 1)
../Elfheader.c:555: warning: unused variable 'str2'
make: gtk-config: Command not found
gcc -Wall -O2 -fomit-frame-pointer -finline-functions -ffast-math -fno-strict-al
iasing -m128bit-long-double -I. -I.. -I../IPU -I../DebugTools -D__LINUX__ -DENAB
LE_NLS -DPACKAGE=\"pcsx2\" -I../ix86-32 -I../x86  -c -o ../Hw.o ../Hw.c -MD -MF
../Hw.d
make: gtk-config: Command not found
gcc -Wall -O2 -fomit-frame-pointer -finline-functions -ffast-math -fno-strict-al
iasing -m128bit-long-double -I. -I.. -I../IPU -I../DebugTools -D__LINUX__ -DENAB
LE_NLS -DPACKAGE=\"pcsx2\" -I../ix86-32 -I../x86  -c -o ../Memory.o ../Memory.c
-MD -MF ../Memory.d
../Memory.c: In function 'memInit':
../Memory.c:137: warning: pointer targets in assignment differ in signedness
../Memory.c:138: warning: pointer targets in assignment differ in signedness
../Memory.c:139: warning: pointer targets in assignment differ in signedness
../Memory.c:140: warning: pointer targets in assignment differ in signedness
../Memory.c:141: warning: pointer targets in assignment differ in signedness
../Memory.c:142: warning: pointer targets in assignment differ in signedness
make: gtk-config: Command not found
gcc -Wall -O2 -fomit-frame-pointer -finline-functions -ffast-math -fno-strict-al
iasing -m128bit-long-double -I. -I.. -I../IPU -I../DebugTools -D__LINUX__ -DENAB
LE_NLS -DPACKAGE=\"pcsx2\" -I../ix86-32 -I../x86  -c -o ../Misc.o ../Misc.c -MD
-MF ../Misc.d
../Misc.c: In function 'GetBiosVersion':
../Misc.c:138: warning: pointer targets in assignment differ in signedness
../Misc.c: In function 'IsBIOS':
../Misc.c:227: warning: format '%d' expects type 'int', but argument 3 has type
'__off_t'
../Misc.c: In function 'CheckCdrom':
../Misc.c:267: warning: pointer targets in passing argument 2 of '__builtin_strn
cpy' differ in signedness
../Misc.c: In function 'injectIRX':
../Misc.c:684: warning: pointer targets in assignment differ in signedness
../Misc.c:684: warning: comparison of distinct pointer types lacks a cast
../Misc.c:698: warning: pointer targets in assignment differ in signedness
../Misc.c:700: warning: pointer targets in assignment differ in signedness
../Misc.c:704: warning: pointer targets in assignment differ in signedness
../Misc.c:709: warning: pointer targets in assignment differ in signedness
../Misc.c:722: warning: pointer targets in assignment differ in signedness
make: gtk-config: Command not found
gcc -Wall -O2 -fomit-frame-pointer -finline-functions -ffast-math -fno-strict-al                                                                           iasing -m128bit-long-double -I. -I.. -I../IPU -I../DebugTools -D__LINUX__ -DENAB                                                                           LE_NLS -DPACKAGE=\"pcsx2\" -I../ix86-32 -I../x86  -c -o ../GS.o ../GS.c -MD -MF                                                                            ../GS.d
make: gtk-config: Command not found
gcc -Wall -O2 -fomit-frame-pointer -finline-functions -ffast-math -fno-strict-al                                                                           iasing -m128bit-long-double -I. -I.. -I../IPU -I../DebugTools -D__LINUX__ -DENAB                                                                           LE_NLS -DPACKAGE=\"pcsx2\" -I../ix86-32 -I../x86  -c -o ../FiFo.o ../FiFo.c -MD                                                                            -MF ../FiFo.d
../FiFo.c: In function 'fifo_get3':
../FiFo.c:75: error: invalid lvalue in assignment
../FiFo.c: In function 'fifo_get':
../FiFo.c:110: error: invalid lvalue in assignment
../FiFo.c: In function 'fifo_get2':
../FiFo.c:138: error: invalid lvalue in assignment
make: *** [../FiFo.o] Error 1
So, I've tried quite a few things and got all the needed libraries installed, but I just can't get it!?

Also, last time I was here, I remember wanting to help out and join to community...and for some reason I was banned, I expect that not happen again.
 

· Registered
Joined
·
19 Posts
Sentertainment said:
It seems to be the only one supporting linux and well, I want to see how it works under linux compared to Windows. So, I'm trying to compile it and well, I get alot of errors! (I'm compiling it as the pre-build is not working right...not detecting all plugins and well, I want an optimized install)
well it is optimized more than your build would be

Sentertainment said:
So...here's the prob:
make: gtk-config: Command not found
make sure you have gtk2 devel libs

Sentertainment said:
../FiFo.c: In function 'fifo_get3':
../FiFo.c:75: error: invalid lvalue in assignment
../FiFo.c: In function 'fifo_get':
../FiFo.c:110: error: invalid lvalue in assignment
../FiFo.c: In function 'fifo_get2':
../FiFo.c:138: error: invalid lvalue in assignment
make: *** [../FiFo.o] Error 1
probably some crappy fedora core with gcc 4.0 ? well i heard it doesn't compile under it (these lines are deprecated on v3.xx and seem unsupported now). but you can rewrite them can't you? if not i sugest reading configuration guide and configuring it properly
 
1 - 2 of 2 Posts
This is an older thread, you may not receive a response, and could be reviving an old thread. Please consider creating a new thread.
Top